Reaction Details
TargetReceptor tyrosine-protein kinase erbB-2
LigandBDBM50229343
Substrate/Competitorn/a
Meas. Tech.ChEMBL_462988 (CHEMBL928909)
IC50 23±n/a nM
Citation Barlaam, BActon, DGBallard, PBradbury, RHCross, DDucray, RGermain, HHudson, KKlinowska, TMagnien, FOgilvie, DJOlivier, ARoss, HSSmith, RTrigwell, CBVautier, MWright, L Neutral 5-substituted 4-indazolylaminoquinazolines as potent, orally active inhibitors of erbB2 receptor tyrosine kinase. Bioorg Med Chem Lett18:1799-803 (2008) 
 
Receptor tyrosine-protein kinase erbB-2
Name:Receptor tyrosine-protein kinase erbB-2
Type:n/a
Mol. Mass.:137894.47
Organism:Homo sapiens (Human)
Description:P04626
Residue:1255
BDBM50229343
NameBDBM50229343
Synonyms:(R)-N,N-dimethyl-2-(4-(3-methyl-4-(6-methylpyridin-3-yloxy)phenylamino)quinazolin-5-yloxy)propanamide | CHEMBL256362
TypeSmall organic molecule
Emp. Form.C26H27N5O3
Mol. Mass.457.5243
SMILESC[C@@H](Oc1cccc2ncnc(Nc3ccc(Oc4ccc(C)nc4)c(C)c3)c12)C(=O)N(C)C