Reaction Details
TargetBotulinum neurotoxin type A
LigandBDBM50242333
Substrate/Competitorn/a
Meas. Tech.ChEMBL_508387 (CHEMBL1008251)
Ki 300±n/a nM
Citation Burnett, JCRuthel, GStegmann, CMPanchal, RGNguyen, TLHermone, ARStafford, RGLane, DJKenny, TAMcGrath, CFWipf, PStahl, AMSchmidt, JJGussio, RBrunger, ATBavari, S Inhibition of metalloprotease botulinum serotype A from a pseudo-peptide binding mode to a small molecule that is active in primary neurons. J Biol Chem282:5004-14 (2007) 
 
Botulinum neurotoxin type A
Name:Botulinum neurotoxin type A
Type:PROTEIN
Mol. Mass.:149421.96
Organism:Clostridium botulinum (strain Hall / ATCC 3502 / NCTC 13319 / Type A)
Description:ChEMBL_987932
Residue:1296
BDBM50242333
NameBDBM50242333
Synonyms:(S)-2-{(S)-2-[(S)-6-Amino-2-((2S,3R)-2-{(S)-2-[(S)-5-guanidino-2-((S)-2-mercapto-3-phenyl-propionylamino)-pentanoylamino]-propionylamino}-3-hydroxy-butyrylamino)-hexanoylamino]-4-methylsulfanyl-butyrylamino}-4-methyl-pentanoic acid | CHEMBL505020
TypeSmall organic molecule
Emp. Form.C39H66N10O9S2
Mol. Mass.883.133
SMILESCSCC[C@H](NC(=O)[C@H](CCCCN)NC(=O)[C@@H](NC(=O)[C@H](C)NC(=O)[C@H](CCCNC(N)=N)NC(=O)[C@@H](S)Cc1ccccc1)[C@@H](C)O)C(=O)N[C@@H](CC(C)C)C(O)=O