Reaction Details
TargetBotulinum neurotoxin type A
LigandBDBM50242337
Substrate/Competitorn/a
Meas. Tech.ChEMBL_508387 (CHEMBL1008251)
Ki 700±n/a nM
Citation Burnett, JCRuthel, GStegmann, CMPanchal, RGNguyen, TLHermone, ARStafford, RGLane, DJKenny, TAMcGrath, CFWipf, PStahl, AMSchmidt, JJGussio, RBrunger, ATBavari, S Inhibition of metalloprotease botulinum serotype A from a pseudo-peptide binding mode to a small molecule that is active in primary neurons. J Biol Chem282:5004-14 (2007) 
 
Botulinum neurotoxin type A
Name:Botulinum neurotoxin type A
Type:PROTEIN
Mol. Mass.:149421.96
Organism:Clostridium botulinum (strain Hall / ATCC 3502 / NCTC 13319 / Type A)
Description:ChEMBL_987932
Residue:1296
BDBM50242337
NameBDBM50242337
Synonyms:(S)-2-{(S)-2-[(S)-6-Amino-2-((S)-2-{(S)-2-[(S)-5-guanidino-2-((S)-2-mercapto-3-phenyl-propionylamino)-pentanoylamino]-propionylamino}-propionylamino)-hexanoylamino]-4-methylsulfanyl-butyrylamino}-4-methyl-pentanoic acid | CHEMBL508950
TypeSmall organic molecule
Emp. Form.C38H64N10O8S2
Mol. Mass.853.107
SMILES[#6]-[#16]-[#6]-[#6]-[#6@H](-[#7]-[#6](=O)-[#6@H](-[#6]-[#6]-[#6]-[#6]-[#7])-[#7]-[#6](=O)-[#6@H](-[#6])-[#7]-[#6](=O)-[#6@H](-[#6])-[#7]-[#6](=O)-[#6@H](-[#6]-[#6]-[#6]\[#7]=[#6](/[#7])-[#7])-[#7]-[#6](=O)-[#6@@H](-[#16])-[#6]-c1ccccc1)-[#6](=O)-[#7]-[#6@@H](-[#6]-[#6](-[#6])-[#6])-[#6](-[#8])=O