Reaction Details
TargetGonadotropin-releasing hormone receptor
LigandBDBM50166458
Substrate/Competitorn/a
Meas. Tech.ChEMBL_552282 (CHEMBL995612)
Ki 1.1±n/a nM
Citation Chen, CChen, YPontillo, JGuo, ZHuang, CQWu, DMadan, AChen, TWen, JXie, QTucci, FCRowbottom, MZhu, YFWade, WSaunders, JBozigian, HStruthers, RS Potent and orally bioavailable zwitterion GnRH antagonists with low CYP3A4 inhibitory activity. Bioorg Med Chem Lett18:3301-5 (2008) 
 
Gonadotropin-releasing hormone receptor
Name:Gonadotropin-releasing hormone receptor
Type:Enzyme
Mol. Mass.:37749.45
Organism:Homo sapiens (Human)
Description:P30968
Residue:328
BDBM50166458
NameBDBM50166458
Synonyms:(R)-1-(2-fluoro-6-(trifluoromethyl)benzyl)-3-(2-amino-2-phenylethyl)-5-(2-chlorophenyl)pyrimidine-2,4(1H,3H)-dione CHEMBL189164
TypeSmall organic molecule
Emp. Form.C26H20ClF4N3O2
Mol. Mass.517.903
SMILESN[C@@H](Cn1c(=O)c(cn(Cc2c(F)cccc2C(F)(F)F)c1=O)-c1ccccc1Cl)c1ccccc1