Reaction Details
TargetDelta-type opioid receptor
LigandBDBM29995
Substrate/Competitorn/a
Meas. Tech.ChEMBL_556073 (CHEMBL953426)
IC50 1200±n/a nM
Citation Okamoto, OKobayashi, KKawamoto, HIto, SYoshizumi, TYamamoto, IHashimoto, MShimizu, ATakahashi, HIshii, YOzaki, SOhta, H Novel ORL1-selective antagonists with oral bioavailability and brain penetrability. Bioorg Med Chem Lett18:3282-5 (2008) 
 
Delta-type opioid receptor
Name:Delta-type opioid receptor
Type:G Protein-Coupled Receptor (GPCR)
Mol. Mass.:40382.98
Organism:Homo sapiens (Human)
Description:Competition binding assays were carried out using membrane preparations from transfected HN9.10 cells that constitutively expressed the delta opioid receptor.
Residue:372
BDBM29995
NameBDBM29995
Synonyms:CHEMBL494350 | benzimidazole-based antagonist, 1
TypeSmall organic molecule
Emp. Form.C18H27ClN4OS
Mol. Mass.382.951
SMILESC[C@@H]1CN(CCO)CCN1c1cc2[nH]c(SC(C)(C)C)nc2cc1Cl