Reaction Details
TargetMu-type opioid receptor
LigandBDBM50239754
Substrate/Competitorn/a
Meas. Tech.ChEMBL_556068 (CHEMBL953421)
IC50 4400±n/a nM
Citation Okamoto, OKobayashi, KKawamoto, HIto, SYoshizumi, TYamamoto, IHashimoto, MShimizu, ATakahashi, HIshii, YOzaki, SOhta, H Novel ORL1-selective antagonists with oral bioavailability and brain penetrability. Bioorg Med Chem Lett18:3282-5 (2008) 
 
Mu-type opioid receptor
Name:Mu-type opioid receptor
Type:G Protein-Coupled Receptor (GPCR)
Mol. Mass.:44789.51
Organism:Homo sapiens (Human)
Description:P35372
Residue:400
BDBM50239754
NameBDBM50239754
Synonyms:2-(4-(2-(tert-butylthio)-6-chloro-3H-benzo[d]imidazol-5-yl)piperazin-1-yl)ethanol | CHEMBL259185
TypeSmall organic molecule
Emp. Form.C17H25ClN4OS
Mol. Mass.368.925
SMILESCC(C)(C)Sc1nc2cc(Cl)c(cc2[nH]1)N1CCN(CCO)CC1