Reaction Details
TargetNociceptin receptor
LigandBDBM50239749
Substrate/Competitorn/a
Meas. Tech.ChEMBL_556065 (CHEMBL953418)
IC50 1.2±n/a nM
Citation Okamoto, OKobayashi, KKawamoto, HIto, SYoshizumi, TYamamoto, IHashimoto, MShimizu, ATakahashi, HIshii, YOzaki, SOhta, H Novel ORL1-selective antagonists with oral bioavailability and brain penetrability. Bioorg Med Chem Lett18:3282-5 (2008) 
 
Nociceptin receptor
Name:Nociceptin receptor
Type:G Protein-Coupled Receptor (GPCR)
Mol. Mass.:40702.87
Organism:Homo sapiens (Human)
Description:P41146
Residue:370
BDBM50239749
NameBDBM50239749
Synonyms:2-(4-(6-chloro-2-(3-methylpentan-3-ylthio)-3H-benzo[d]imidazol-5-yl)piperazin-1-yl)ethanol CHEMBL263918
TypeSmall organic molecule
Emp. Form.C19H29ClN4OS
Mol. Mass.396.978
SMILESCCC(C)(CC)Sc1nc2cc(Cl)c(cc2[nH]1)N1CCN(CCO)CC1