Reaction Details
TargetBeta-secretase 1
LigandBDBM50271631
Substrate/Competitorn/a
Meas. Tech.ChEMBL_556475 (CHEMBL955692)
IC50 140±n/a nM
Citation Cumming, JNLe, TXBabu, SCarroll, CChen, XFavreau, LGaspari, PGuo, THobbs, DWHuang, YIserloh, UKennedy, MEKuvelkar, RLi, GLowrie, JMcHugh, NAOzgur, LPan, JParker, EMSaionz, KStamford, AWStrickland, CTadesse, DVoigt, JWang, LWu, YZhang, LZhang, Q Rational design of novel, potent piperazinone and imidazolidinone BACE1 inhibitors. Bioorg Med Chem Lett18:3236-41 (2008) 
 
Beta-secretase 1
Name:Beta-secretase 1
Type:Protein
Mol. Mass.:55755.10
Organism:Homo sapiens (Human)
Description:P56817
Residue:501
BDBM50271631
NameBDBM50271631
Synonyms:CHEMBL511110 | N-((1S,2S)-1-((S)-4-benzyl-3-oxopiperazin-2-yl)-3-(3,5-difluorophenyl)-1-hydroxypropan-2-yl)-5-((R)-2-(methoxymethyl)pyrrolidine-1-carbonyl)nicotinamide
TypeSmall organic molecule
Emp. Form.C33H37F2N5O5
Mol. Mass.621.6742
SMILESCOC[C@H]1CCCN1C(=O)c1cncc(c1)C(=O)N[C@@H](Cc1cc(F)cc(F)c1)[C@H](O)[C@@H]1NCCN(Cc2ccccc2)C1=O