Reaction Details
TargetBeta-secretase 1
LigandBDBM50271630
Substrate/Competitorn/a
Meas. Tech.ChEMBL_556475 (CHEMBL955692)
IC50 57±n/a nM
Citation Cumming, JNLe, TXBabu, SCarroll, CChen, XFavreau, LGaspari, PGuo, THobbs, DWHuang, YIserloh, UKennedy, MEKuvelkar, RLi, GLowrie, JMcHugh, NAOzgur, LPan, JParker, EMSaionz, KStamford, AWStrickland, CTadesse, DVoigt, JWang, LWu, YZhang, LZhang, Q Rational design of novel, potent piperazinone and imidazolidinone BACE1 inhibitors. Bioorg Med Chem Lett18:3236-41 (2008) 
 
Beta-secretase 1
Name:Beta-secretase 1
Type:Protein
Mol. Mass.:55755.10
Organism:Homo sapiens (Human)
Description:P56817
Residue:501
BDBM50271630
NameBDBM50271630
Synonyms:CHEMBL453413 | N-((1S,2S)-1-((S)-4-benzyl-3-oxopiperazin-2-yl)-3-(3,5-difluorophenyl)-1-hydroxypropan-2-yl)-3-methoxy-5-((R)-2-(methoxymethyl)pyrrolidine-1-carbonyl)benzamide
TypeSmall organic molecule
Emp. Form.C35H40F2N4O6
Mol. Mass.650.7121
SMILESCOC[C@H]1CCCN1C(=O)c1cc(OC)cc(c1)C(=O)N[C@@H](Cc1cc(F)cc(F)c1)[C@H](O)[C@@H]1NCCN(Cc2ccccc2)C1=O