Reaction Details
TargetBeta-secretase 1
LigandBDBM50271865
Substrate/Competitorn/a
Meas. Tech.ChEMBL_556474 (CHEMBL955691)
IC50 345±n/a nM
Citation Cumming, JNLe, TXBabu, SCarroll, CChen, XFavreau, LGaspari, PGuo, THobbs, DWHuang, YIserloh, UKennedy, MEKuvelkar, RLi, GLowrie, JMcHugh, NAOzgur, LPan, JParker, EMSaionz, KStamford, AWStrickland, CTadesse, DVoigt, JWang, LWu, YZhang, LZhang, Q Rational design of novel, potent piperazinone and imidazolidinone BACE1 inhibitors. Bioorg Med Chem Lett18:3236-41 (2008) 
 
Beta-secretase 1
Name:Beta-secretase 1
Type:Protein
Mol. Mass.:55755.10
Organism:Homo sapiens (Human)
Description:P56817
Residue:501
BDBM50271865
NameBDBM50271865
Synonyms:CHEMBL510737 | N1-((1S,2S)-3-(3,5-difluorophenyl)-1-hydroxy-1-((R)-4-phenylpiperazin-2-yl)propan-2-yl)-5-methyl-N3,N3-dipropylisophthalamide
TypeSmall organic molecule
Emp. Form.C34H42F2N4O3
Mol. Mass.592.7191
SMILESCCCN(CCC)C(=O)c1cc(C)cc(c1)C(=O)N[C@@H](Cc1cc(F)cc(F)c1)[C@H](O)[C@H]1CN(CCN1)c1ccccc1