Reaction Details
TargetGonadotropin-releasing hormone receptor
LigandBDBM50244135
Substrate/Competitorn/a
Meas. Tech.ChEMBL_554183 (CHEMBL963640)
IC50 14±n/a nM
Citation Pelletier, JCChengalvala, MCottom, JFeingold, IGarrick, LGreen, DHauze, DHuselton, CJetter, JKao, WKopf, GSLundquist, JTMann, CMehlmann, JRogers, JShanno, LWrobel, J 2-phenyl-4-piperazinylbenzimidazoles: orally active inhibitors of the gonadotropin releasing hormone (GnRH) receptor. Bioorg Med Chem16:6617-40 (2008) 
 
Gonadotropin-releasing hormone receptor
Name:Gonadotropin-releasing hormone receptor
Type:Enzyme
Mol. Mass.:37749.45
Organism:Homo sapiens (Human)
Description:P30968
Residue:328
BDBM50244135
NameBDBM50244135
Synonyms:4-{4-[2-(4-tert-Butyl-phenyl)-1H-benzoimidazol-4-yl]-piperazin-1-ylmethyl}-1,3-dihydro-benzoimidazole-2-thione | CHEMBL459659
TypeSmall organic molecule
Emp. Form.C29H32N6S
Mol. Mass.496.67
SMILESCC(C)(C)c1ccc(cc1)-c1nc2c(cccc2[nH]1)N1CCN(Cc2cccc3[nH]c(=S)[nH]c23)CC1