Reaction Details
Target5-hydroxytryptamine receptor 1A
LigandBDBM50243699
Substrate/Competitorn/a
Meas. Tech.ChEMBL_554184 (CHEMBL963641)
Ki 19±n/a nM
Citation Pelletier, JCChengalvala, MCottom, JFeingold, IGarrick, LGreen, DHauze, DHuselton, CJetter, JKao, WKopf, GSLundquist, JTMann, CMehlmann, JRogers, JShanno, LWrobel, J 2-phenyl-4-piperazinylbenzimidazoles: orally active inhibitors of the gonadotropin releasing hormone (GnRH) receptor. Bioorg Med Chem16:6617-40 (2008) 
 
5-hydroxytryptamine receptor 1A
Name:5-hydroxytryptamine receptor 1A
Type:n/a
Mol. Mass.:46122.49
Organism:Homo sapiens (Human)
Description:n/a
Residue:422
BDBM50243699
NameBDBM50243699
Synonyms:2-(trifluoromethyl)-7-(2-(4-(2-(trifluoromethyl)-1H-benzo[d]imidazol-4-yl)piperazin-1-yl)ethoxy)-1H-benzo[d]imidazole | CHEMBL472117
TypeSmall organic molecule
Emp. Form.C22H20F6N6O
Mol. Mass.498.4242
SMILESFC(F)(F)c1nc2cccc(OCCN3CCN(CC3)c3cccc4[nH]c(nc34)C(F)(F)F)c2[nH]1