Reaction Details
TargetGonadotropin-releasing hormone receptor
LigandBDBM50244175
Substrate/Competitorn/a
Meas. Tech.ChEMBL_554183 (CHEMBL963640)
IC50 63±n/a nM
Citation Pelletier, JCChengalvala, MCottom, JFeingold, IGarrick, LGreen, DHauze, DHuselton, CJetter, JKao, WKopf, GSLundquist, JTMann, CMehlmann, JRogers, JShanno, LWrobel, J 2-phenyl-4-piperazinylbenzimidazoles: orally active inhibitors of the gonadotropin releasing hormone (GnRH) receptor. Bioorg Med Chem16:6617-40 (2008) 
 
Gonadotropin-releasing hormone receptor
Name:Gonadotropin-releasing hormone receptor
Type:Enzyme
Mol. Mass.:37749.45
Organism:Homo sapiens (Human)
Description:P30968
Residue:328
BDBM50244175
NameBDBM50244175
Synonyms:4-{4-[2-(4-tert-Butyl-phenyl)-1H-benzoimidazol-4-yl]-piperazin-1-ylmethyl}-1,3-dihydro-benzoimidazol-2-one | CHEMBL460892
TypeSmall organic molecule
Emp. Form.C29H32N6O
Mol. Mass.480.604
SMILESCC(C)(C)c1ccc(cc1)-c1nc2c(cccc2[nH]1)N1CCN(Cc2cccc3[nH]c(=O)[nH]c23)CC1