Reaction Details
TargetDelta-type opioid receptor
LigandBDBM50243887
Substrate/Competitorn/a
Meas. Tech.ChEMBL_491468 (CHEMBL949524)
IC50>10000±n/a nM
Citation Yoshizumi, TTakahashi, HMiyazoe, HSugimoto, YTsujita, TKato, TIto, HKawamoto, HHirayama, MIchikawa, DAzuma-Kanoh, TOzaki, SShibata, YTani, TChiba, MIshii, YOkuda, STadano, KFukuroda, TOkamoto, OOhta, H A novel class of cycloalkano[b]pyridines as potent and orally active opioid receptor-like 1 antagonists with minimal binding affinity to the hERG K+ channel. J Med Chem51:4021-9 (2008) 
 
Delta-type opioid receptor
Name:Delta-type opioid receptor
Type:G Protein-Coupled Receptor (GPCR)
Mol. Mass.:40382.98
Organism:Homo sapiens (Human)
Description:Competition binding assays were carried out using membrane preparations from transfected HN9.10 cells that constitutively expressed the delta opioid receptor.
Residue:372
BDBM50243887
NameBDBM50243887
Synonyms:(-)-(3R,4R)-4-(2-Chloro-4-fluorophenyl)-3-hydroxy-1-{[(6R,8S)-8-hydroxy-5,6,7,8-tetrahydroquinolin-6-yl]methyl}piperidinium Chloride CHEMBL487458
TypeSmall organic molecule
Emp. Form.C21H24ClFN2O2
Mol. Mass.390.879
SMILESO[C@H]1CN(C[C@H]2C[C@H](O)c3ncccc3C2)CC[C@@H]1c1ccc(F)cc1Cl