Reaction Details
TargetNociceptin receptor
LigandBDBM50244336
Substrate/Competitorn/a
Meas. Tech.ChEMBL_491434 (CHEMBL948529)
Ki 11±n/a nM
Citation Yoshizumi, TTakahashi, HMiyazoe, HSugimoto, YTsujita, TKato, TIto, HKawamoto, HHirayama, MIchikawa, DAzuma-Kanoh, TOzaki, SShibata, YTani, TChiba, MIshii, YOkuda, STadano, KFukuroda, TOkamoto, OOhta, H A novel class of cycloalkano[b]pyridines as potent and orally active opioid receptor-like 1 antagonists with minimal binding affinity to the hERG K+ channel. J Med Chem51:4021-9 (2008) 
 
Nociceptin receptor
Name:Nociceptin receptor
Type:G Protein-Coupled Receptor (GPCR)
Mol. Mass.:40702.87
Organism:Homo sapiens (Human)
Description:P41146
Residue:370
BDBM50244336
NameBDBM50244336
Synonyms:(6R,8S)-6-((4-o-tolylpiperidin-1-yl)methyl)-5,6,7,8-tetrahydroquinolin-8-ol | CHEMBL471982
TypeSmall organic molecule
Emp. Form.C22H28N2O
Mol. Mass.336.4705
SMILESCc1ccccc1C1CCN(C[C@H]2C[C@H](O)c3ncccc3C2)CC1