Reaction Details
TargetCytochrome P450 3A4
LigandBDBM50262375
Substrate/Competitorn/a
Meas. Tech.ChEMBL_514583 (CHEMBL979961)
IC50 600±n/a nM
Citation Sweeney, ZKDunn, JPLi, YHeilek, GDunten, PElworthy, TRHan, XHarris, SFHirschfeld, DRHogg, JHHuber, WKaiser, ACKertesz, DJKim, WMirzadegan, TRoepel, MGSaito, YDSilva, TMSwallow, STracy, JLVillasenor, AVora, HZhou, ASKlumpp, K Discovery and optimization of pyridazinone non-nucleoside inhibitors of HIV-1 reverse transcriptase. Bioorg Med Chem Lett18:4352-4 (2008) 
 
Cytochrome P450 3A4
Name:Cytochrome P450 3A4
Type:Enzyme
Mol. Mass.:57349.57
Organism:Homo sapiens (Human)
Description:n/a
Residue:503
BDBM50262375
NameBDBM50262375
Synonyms:6-((7-(3-chlorobenzoyl)benzofuran-5-yl)methyl)pyridazin-3(2H)-one | CHEMBL446793
TypeSmall organic molecule
Emp. Form.C20H13ClN2O3
Mol. Mass.364.782
SMILESClc1cccc(c1)C(=O)c1cc(Cc2ccc(=O)[nH]n2)cc2ccoc12