Reaction Details
TargetTyrosine-protein kinase Blk
LigandBDBM4779
Substrate/Competitorn/a
Meas. Tech.ChEMBL_540168 (CHEMBL1026516)
IC50 29±n/a nM
Citation Hur, WVelentza, AKim, SFlatauer, LJiang, XValente, DMason, DESuzuki, MLarson, BZhang, JZagorska, ADidonato, MNagle, AWarmuth, MBalk, SPPeters, ECGray, NS Clinical stage EGFR inhibitors irreversibly alkylate Bmx kinase. Bioorg Med Chem Lett18:5916-9 (2008) 
 
Tyrosine-protein kinase Blk
Name:Tyrosine-protein kinase Blk
Type:Protein
Mol. Mass.:57711.88
Organism:Homo sapiens (Human)
Description:P51451
Residue:505
BDBM4779
NameBDBM4779
Synonyms:CHEMBL31965 CI-1033 N-{4-[(3-chloro-4-fluorophenyl)amino]-7-[3-(morpholin-4-yl)propoxy]quinazolin-6-yl}prop-2-enamide US10507209, Compound CI-1033 cid_156414
TypeSmall organic molecule
Emp. Form.C24H25ClFN5O3
Mol. Mass.485.938
SMILESFc1ccc(Nc2ncnc3cc(OCCCN4CCOCC4)c(NC(=O)C=C)cc23)cc1Cl