Reaction Details
TargetSerine/threonine-protein kinase STK11
LigandBDBM4567
Substrate/Competitorn/a
Meas. Tech.ChEMBL_540163 (CHEMBL1026511)
IC50>10000±n/a nM
Citation Hur, WVelentza, AKim, SFlatauer, LJiang, XValente, DMason, DESuzuki, MLarson, BZhang, JZagorska, ADidonato, MNagle, AWarmuth, MBalk, SPPeters, ECGray, NS Clinical stage EGFR inhibitors irreversibly alkylate Bmx kinase. Bioorg Med Chem Lett18:5916-9 (2008) 
 
Serine/threonine-protein kinase STK11
Name:Serine/threonine-protein kinase STK11
Type:PROTEIN
Mol. Mass.:48640.33
Organism:Homo sapiens (Human)
Description:ChEMBL_655439
Residue:433
BDBM4567
NameBDBM4567
Synonyms:4-anilinoquinazoline deriv. 2 CHEMBL285063 US9422297, PD168393
TypeSmall organic molecule
Emp. Form.C17H13BrN4O
Mol. Mass.369.215
SMILESBrc1cccc(Nc2ncnc3ccc(NC(=O)C=C)cc23)c1