Reaction Details
TargetTyrosine-protein kinase ABL1
LigandBDBM50025052
Substrate/Competitorn/a
Meas. Tech.ChEMBL_511628 (CHEMBL976275)
IC50<0.460000±n/a nM
Citation Wang, YShakespeare, WCHuang, WSSundaramoorthi, RLentini, SDas, SLiu, SBanda, GWen, DZhu, XXu, QKeats, JWang, FWardwell, SNing, YSnodgrass, JTBroudy, MIRussian, KDalgarno, DClackson, TSawyer, TK Novel N9-arenethenyl purines as potent dual Src/Abl tyrosine kinase inhibitors. Bioorg Med Chem Lett18:4907-12 (2008) 
 
Tyrosine-protein kinase ABL1
Name:Tyrosine-protein kinase ABL1
Type:Enzyme
Mol. Mass.:122897.30
Organism:Homo sapiens (Human)
Description:P00519
Residue:1130
BDBM50025052
NameBDBM50025052
Synonyms:CHEMBL517256
TypeSmall organic molecule
Emp. Form.C26H27N6OP
Mol. Mass.470.5059
SMILESCc1cccc(C)c1\C=C\n1cnc2c(Nc3ccc(cc3)P(C)(C)=O)nc(CCC#N)nc12