Reaction Details
TargetProto-oncogene tyrosine-protein kinase Src
LigandBDBM50244663
Substrate/Competitorn/a
Meas. Tech.ChEMBL_511627 (CHEMBL976274)
IC50<0.460000±n/a nM
Citation Wang, YShakespeare, WCHuang, WSSundaramoorthi, RLentini, SDas, SLiu, SBanda, GWen, DZhu, XXu, QKeats, JWang, FWardwell, SNing, YSnodgrass, JTBroudy, MIRussian, KDalgarno, DClackson, TSawyer, TK Novel N9-arenethenyl purines as potent dual Src/Abl tyrosine kinase inhibitors. Bioorg Med Chem Lett18:4907-12 (2008) 
 
Proto-oncogene tyrosine-protein kinase Src
Name:Proto-oncogene tyrosine-protein kinase Src
Type:Protein
Mol. Mass.:59838.60
Organism:Homo sapiens (Human)
Description:P12931
Residue:536
BDBM50244663
NameBDBM50244663
Synonyms:9-(2,6-dimethylstyryl)-N-(4-(dimethylphosphoryl)phenyl)-2-isopropoxy-9H-purin-6-amine | CHEMBL516498
TypeSmall organic molecule
Emp. Form.C26H30N5O2P
Mol. Mass.475.5225
SMILESCC(C)Oc1nc(Nc2ccc(cc2)P(C)(C)=O)c2ncn(\C=C\c3c(C)cccc3C)c2n1