Reaction Details
TargetGlucocorticoid receptor
LigandBDBM50272523
Substrate/Competitorn/a
Meas. Tech.ChEMBL_510611 (CHEMBL1002258)
IC50 1.3±n/a nM
Citation Ali, ABalkovec, JMGreenlee, MHammond, MLRouen, GTaylor, GEinstein, MGe, LHarris, GKelly, TMMazur, PPandit, SSantoro, JSitlani, AWang, CWilliamson, JForrest, MJCarballo-Jane, ELuell, SLowitz, KVisco, D Discovery of betamethasone 17alpha-carbamates as dissociated glucocorticoid receptor modulators in the rat. Bioorg Med Chem16:7535-42 (2008) 
 
Glucocorticoid receptor
Name:Glucocorticoid receptor
Type:Enzyme
Mol. Mass.:85656.87
Organism:Homo sapiens (Human)
Description:P04150
Residue:777
BDBM50272523
NameBDBM50272523
Synonyms:(11beta,16beta)-9-Fluoro-11,21-dihydroxy-16-methyl-3,20-dioxopregna-1,4-dien-17-yl (1S)-1-phenylethylcarbamate | CHEMBL500897
TypeSmall organic molecule
Emp. Form.C31H38FNO6
Mol. Mass.539.6349
SMILESC[C@H](NC(=O)O[C@@]1([C@@H](C)C[C@H]2[C@@H]3CCC4=CC(=O)C=C[C@]4(C)[C@@]3(F)[C@@H](O)C[C@]12C)C(=O)CO)c1ccccc1