Reaction Details
TargetPeroxisome proliferator-activated receptor gamma
LigandBDBM50244749
Substrate/Competitorn/a
Meas. Tech.ChEMBL_512442 (CHEMBL980783)
EC50 94±n/a nM
Citation Debenham, SDChan, ALau, FWLiu, WWood, HBLemme, KColwell, LHabulihaz, BAkiyama, TEEinstein, MDoebber, TWSharma, NWang, CFWu, MBerger, JPMeinke, PT Highly functionalized 7-azaindoles as selective PPAR gamma modulators. Bioorg Med Chem Lett18:4798-801 (2008) 
 
Peroxisome proliferator-activated receptor gamma
Name:Peroxisome proliferator-activated receptor gamma
Type:Nuclear Receptor
Mol. Mass.:57613.46
Organism:Homo sapiens (Human)
Description:P37231
Residue:505
BDBM50244749
NameBDBM50244749
Synonyms:(S)-2-(5-((3-(4-chlorophenoxy)-6-fluoro-2-methyl-1H-pyrrolo[2,3-b]pyridin-1-yl)methyl)-2-fluorophenoxy)propanoic acid | CHEMBL461379
TypeSmall organic molecule
Emp. Form.C24H19ClF2N2O4
Mol. Mass.472.868
SMILESC[C@H](Oc1cc(Cn2c(C)c(Oc3ccc(Cl)cc3)c3ccc(F)nc23)ccc1F)C(O)=O