Reaction Details
TargetPeroxisome proliferator-activated receptor gamma
LigandBDBM50244808
Substrate/Competitorn/a
Meas. Tech.ChEMBL_512441 (CHEMBL980782)
IC50 22±n/a nM
Citation Debenham, SDChan, ALau, FWLiu, WWood, HBLemme, KColwell, LHabulihaz, BAkiyama, TEEinstein, MDoebber, TWSharma, NWang, CFWu, MBerger, JPMeinke, PT Highly functionalized 7-azaindoles as selective PPAR gamma modulators. Bioorg Med Chem Lett18:4798-801 (2008) 
 
Peroxisome proliferator-activated receptor gamma
Name:Peroxisome proliferator-activated receptor gamma
Type:Nuclear Receptor
Mol. Mass.:57613.46
Organism:Homo sapiens (Human)
Description:P37231
Residue:505
BDBM50244808
NameBDBM50244808
Synonyms:(S)-2-(2-chloro-5-((3-(4-chlorophenoxy)-2-methyl-6-(trifluoromethyl)-1H-pyrrolo[2,3-b]pyridin-1-yl)methyl)phenoxy)propanoic acid | CHEMBL517436
TypeSmall organic molecule
Emp. Form.C25H19Cl2F3N2O4
Mol. Mass.539.331
SMILESC[C@H](Oc1cc(Cn2c(C)c(Oc3ccc(Cl)cc3)c3ccc(nc23)C(F)(F)F)ccc1Cl)C(O)=O