Reaction Details
TargetPeroxisome proliferator-activated receptor gamma
LigandBDBM50244557
Substrate/Competitorn/a
Meas. Tech.ChEMBL_512441 (CHEMBL980782)
IC50 726±n/a nM
Citation Debenham, SDChan, ALau, FWLiu, WWood, HBLemme, KColwell, LHabulihaz, BAkiyama, TEEinstein, MDoebber, TWSharma, NWang, CFWu, MBerger, JPMeinke, PT Highly functionalized 7-azaindoles as selective PPAR gamma modulators. Bioorg Med Chem Lett18:4798-801 (2008) 
 
Peroxisome proliferator-activated receptor gamma
Name:Peroxisome proliferator-activated receptor gamma
Type:Nuclear Receptor
Mol. Mass.:57613.46
Organism:Homo sapiens (Human)
Description:P37231
Residue:505
BDBM50244557
NameBDBM50244557
Synonyms:(R)-2-(3-((3-(4-methoxybenzoyl)-2-methyl-1H-pyrrolo[2,3-b]pyridin-1-yl)methyl)phenoxy)propanoic acid | CHEMBL452299
TypeSmall organic molecule
Emp. Form.C26H24N2O5
Mol. Mass.444.4792
SMILESCOc1ccc(cc1)C(=O)c1c(C)n(Cc2cccc(O[C@H](C)C(O)=O)c2)c2ncccc12