Reaction Details
TargetPeroxisome proliferator-activated receptor gamma
LigandBDBM50244699
Substrate/Competitorn/a
Meas. Tech.ChEMBL_512442 (CHEMBL980783)
EC50 1±n/a nM
Citation Debenham, SDChan, ALau, FWLiu, WWood, HBLemme, KColwell, LHabulihaz, BAkiyama, TEEinstein, MDoebber, TWSharma, NWang, CFWu, MBerger, JPMeinke, PT Highly functionalized 7-azaindoles as selective PPAR gamma modulators. Bioorg Med Chem Lett18:4798-801 (2008) 
 
Peroxisome proliferator-activated receptor gamma
Name:Peroxisome proliferator-activated receptor gamma
Type:Nuclear Receptor
Mol. Mass.:57613.46
Organism:Homo sapiens (Human)
Description:P37231
Residue:505
BDBM50244699
NameBDBM50244699
Synonyms:(S)-2-(4-fluoro-3-((6-methoxy-3-(4-methoxybenzoyl)-2-methyl-1H-pyrrolo[2,3-b]pyridin-1-yl)methyl)phenoxy)propanoic acid | CHEMBL462378
TypeSmall organic molecule
Emp. Form.C27H25FN2O6
Mol. Mass.492.4956
SMILESCOc1ccc(cc1)C(=O)c1c(C)n(Cc2cc(O[C@@H](C)C(O)=O)ccc2F)c2nc(OC)ccc12