Reaction Details
TargetPeroxisome proliferator-activated receptor alpha
LigandBDBM50244747
Substrate/Competitorn/a
Meas. Tech.ChEMBL_512448 (CHEMBL980789)
IC50>50000±n/a nM
Citation Debenham, SDChan, ALau, FWLiu, WWood, HBLemme, KColwell, LHabulihaz, BAkiyama, TEEinstein, MDoebber, TWSharma, NWang, CFWu, MBerger, JPMeinke, PT Highly functionalized 7-azaindoles as selective PPAR gamma modulators. Bioorg Med Chem Lett18:4798-801 (2008) 
 
Peroxisome proliferator-activated receptor alpha
Name:Peroxisome proliferator-activated receptor alpha
Type:Enzyme
Mol. Mass.:52222.08
Organism:Homo sapiens (Human)
Description:Q07869
Residue:468
BDBM50244747
NameBDBM50244747
Synonyms:(S)-2-(4-chloro-3-((3-(4-chlorophenoxy)-6-fluoro-2-methyl-1H-pyrrolo[2,3-b]pyridin-1-yl)methyl)phenoxy)propanoic acid | CHEMBL461378
TypeSmall organic molecule
Emp. Form.C24H19Cl2FN2O4
Mol. Mass.489.323
SMILESC[C@H](Oc1ccc(Cl)c(Cn2c(C)c(Oc3ccc(Cl)cc3)c3ccc(F)nc23)c1)C(O)=O