Reaction Details
TargetPeroxisome proliferator-activated receptor alpha
LigandBDBM50244701
Substrate/Competitorn/a
Meas. Tech.ChEMBL_512448 (CHEMBL980789)
IC50>50000±n/a nM
Citation Debenham, SDChan, ALau, FWLiu, WWood, HBLemme, KColwell, LHabulihaz, BAkiyama, TEEinstein, MDoebber, TWSharma, NWang, CFWu, MBerger, JPMeinke, PT Highly functionalized 7-azaindoles as selective PPAR gamma modulators. Bioorg Med Chem Lett18:4798-801 (2008) 
 
Peroxisome proliferator-activated receptor alpha
Name:Peroxisome proliferator-activated receptor alpha
Type:Enzyme
Mol. Mass.:52222.08
Organism:Homo sapiens (Human)
Description:Q07869
Residue:468
BDBM50244701
NameBDBM50244701
Synonyms:(S)-2-(4-chloro-3-((6-methoxy-3-(4-methoxybenzoyl)-2-methyl-1H-pyrrolo[2,3-b]pyridin-1-yl)methyl)phenoxy)propanoic acid | CHEMBL460073
TypeSmall organic molecule
Emp. Form.C27H25ClN2O6
Mol. Mass.508.95
SMILESCOc1ccc(cc1)C(=O)c1c(C)n(Cc2cc(O[C@@H](C)C(O)=O)ccc2Cl)c2nc(OC)ccc12