Reaction Details
TargetPeroxisome proliferator-activated receptor delta
LigandBDBM50244750
Substrate/Competitorn/a
Meas. Tech.ChEMBL_512450 (CHEMBL980791)
IC50>50000±n/a nM
Citation Debenham, SDChan, ALau, FWLiu, WWood, HBLemme, KColwell, LHabulihaz, BAkiyama, TEEinstein, MDoebber, TWSharma, NWang, CFWu, MBerger, JPMeinke, PT Highly functionalized 7-azaindoles as selective PPAR gamma modulators. Bioorg Med Chem Lett18:4798-801 (2008) 
 
Peroxisome proliferator-activated receptor delta
Name:Peroxisome proliferator-activated receptor delta
Type:Enzyme
Mol. Mass.:49910.45
Organism:Homo sapiens (Human)
Description:Q03181
Residue:441
BDBM50244750
NameBDBM50244750
Synonyms:(S)-2-(2-chloro-5-((6-chloro-3-(4-chlorophenoxy)-2-methyl-1H-pyrrolo[2,3-b]pyridin-1-yl)methyl)phenoxy)propanoic acid | CHEMBL461944
TypeSmall organic molecule
Emp. Form.C24H19Cl3N2O4
Mol. Mass.505.778
SMILESC[C@H](Oc1cc(Cn2c(C)c(Oc3ccc(Cl)cc3)c3ccc(Cl)nc23)ccc1Cl)C(O)=O