Reaction Details
TargetGastric inhibitory polypeptide receptor
LigandBDBM50245101
Substrate/Competitorn/a
Meas. Tech.ChEMBL_513212 (CHEMBL977342)
IC50 411±n/a nM
Citation Kodra, JTJørgensen, ASAndersen, BBehrens, CBrand, CLChristensen, ITGuldbrandt, MJeppesen, CBKnudsen, LBMadsen, PNishimura, ESams, CSidelmann, UGPedersen, RALynn, FCLau, J Novel glucagon receptor antagonists with improved selectivity over the glucose-dependent insulinotropic polypeptide receptor. J Med Chem51:5387-96 (2008) 
 
Gastric inhibitory polypeptide receptor
Name:Gastric inhibitory polypeptide receptor
Type:PROTEIN
Mol. Mass.:53173.82
Organism:Homo sapiens (Human)
Description:ChEMBL_1518286
Residue:466
BDBM50245101
NameBDBM50245101
Synonyms:(R)-3-{4-[1-(4-Cyclohexylphenyl)-3-(3-methylthio)phenyl-ureidomethyl]benzoylamino}-2-hydroxypropionic acid | CHEMBL528775
TypeSmall organic molecule
Emp. Form.C31H35N3O5S
Mol. Mass.561.692
SMILESCSc1cccc(NC(=O)N(Cc2ccc(cc2)C(=O)NC[C@@H](O)C(O)=O)c2ccc(cc2)C2CCCCC2)c1