Reaction Details
TargetGastric inhibitory polypeptide receptor
LigandBDBM50245098
Substrate/Competitorn/a
Meas. Tech.ChEMBL_513212 (CHEMBL977342)
IC50 93±n/a nM
Citation Kodra, JTJørgensen, ASAndersen, BBehrens, CBrand, CLChristensen, ITGuldbrandt, MJeppesen, CBKnudsen, LBMadsen, PNishimura, ESams, CSidelmann, UGPedersen, RALynn, FCLau, J Novel glucagon receptor antagonists with improved selectivity over the glucose-dependent insulinotropic polypeptide receptor. J Med Chem51:5387-96 (2008) 
 
Gastric inhibitory polypeptide receptor
Name:Gastric inhibitory polypeptide receptor
Type:PROTEIN
Mol. Mass.:53173.82
Organism:Homo sapiens (Human)
Description:ChEMBL_1518286
Residue:466
BDBM50245098
NameBDBM50245098
Synonyms:(R)-3-{4-[1-(4-Cyclohexylphenyl)-3-(3,5-dichlorophenyl)ureidomethyl]benzoylamino}-2-hydroxypropionic acid | CHEMBL487668
TypeSmall organic molecule
Emp. Form.C30H31Cl2N3O5
Mol. Mass.584.49
SMILESO[C@H](CNC(=O)c1ccc(CN(C(=O)Nc2cc(Cl)cc(Cl)c2)c2ccc(cc2)C2CCCCC2)cc1)C(O)=O