Reaction Details
TargetGastric inhibitory polypeptide receptor
LigandBDBM50245062
Substrate/Competitorn/a
Meas. Tech.ChEMBL_513212 (CHEMBL977342)
IC50 74±n/a nM
Citation Kodra, JTJørgensen, ASAndersen, BBehrens, CBrand, CLChristensen, ITGuldbrandt, MJeppesen, CBKnudsen, LBMadsen, PNishimura, ESams, CSidelmann, UGPedersen, RALynn, FCLau, J Novel glucagon receptor antagonists with improved selectivity over the glucose-dependent insulinotropic polypeptide receptor. J Med Chem51:5387-96 (2008) 
 
Gastric inhibitory polypeptide receptor
Name:Gastric inhibitory polypeptide receptor
Type:PROTEIN
Mol. Mass.:53173.82
Organism:Homo sapiens (Human)
Description:ChEMBL_1518286
Residue:466
BDBM50245062
NameBDBM50245062
Synonyms:(R)-3-{4-[3-(3-tert-Butylphenyl)-1-(4-cyclohexylphenyl)ureidomethyl]benzoylamino}-2-hydroxypropionic acid | CHEMBL447742
TypeSmall organic molecule
Emp. Form.C34H41N3O5
Mol. Mass.571.7064
SMILESCC(C)(C)c1cccc(NC(=O)N(Cc2ccc(cc2)C(=O)NC[C@@H](O)C(O)=O)c2ccc(cc2)C2CCCCC2)c1