Reaction Details
TargetGastric inhibitory polypeptide receptor
LigandBDBM50245060
Substrate/Competitorn/a
Meas. Tech.ChEMBL_513212 (CHEMBL977342)
IC50 12±n/a nM
Citation Kodra, JTJørgensen, ASAndersen, BBehrens, CBrand, CLChristensen, ITGuldbrandt, MJeppesen, CBKnudsen, LBMadsen, PNishimura, ESams, CSidelmann, UGPedersen, RALynn, FCLau, J Novel glucagon receptor antagonists with improved selectivity over the glucose-dependent insulinotropic polypeptide receptor. J Med Chem51:5387-96 (2008) 
 
Gastric inhibitory polypeptide receptor
Name:Gastric inhibitory polypeptide receptor
Type:PROTEIN
Mol. Mass.:53173.82
Organism:Homo sapiens (Human)
Description:ChEMBL_1518286
Residue:466
BDBM50245060
NameBDBM50245060
Synonyms:(R)-3-{4-[1-(4-Cyclohexylphenyl)-3-(4-trifluoromethylsulfanylphenyl)ureidomethyl]benzoylamino}-2-hydroxypropionic acid | CHEMBL453457
TypeSmall organic molecule
Emp. Form.C31H32F3N3O5S
Mol. Mass.615.663
SMILESO[C@H](CNC(=O)c1ccc(CN(C(=O)Nc2ccc(SC(F)(F)F)cc2)c2ccc(cc2)C2CCCCC2)cc1)C(O)=O