Reaction Details
TargetGastric inhibitory polypeptide receptor
LigandBDBM50202060
Substrate/Competitorn/a
Meas. Tech.ChEMBL_513212 (CHEMBL977342)
IC50 38±n/a nM
Citation Kodra, JTJørgensen, ASAndersen, BBehrens, CBrand, CLChristensen, ITGuldbrandt, MJeppesen, CBKnudsen, LBMadsen, PNishimura, ESams, CSidelmann, UGPedersen, RALynn, FCLau, J Novel glucagon receptor antagonists with improved selectivity over the glucose-dependent insulinotropic polypeptide receptor. J Med Chem51:5387-96 (2008) 
 
Gastric inhibitory polypeptide receptor
Name:Gastric inhibitory polypeptide receptor
Type:PROTEIN
Mol. Mass.:53173.82
Organism:Homo sapiens (Human)
Description:ChEMBL_1518286
Residue:466
BDBM50202060
NameBDBM50202060
Synonyms:3-{4-[1-(4-tert-Butylphenyl)-3-(4-trifluoromethoxyphenyl)ureidomethyl]benzoylamino}propionicacid CHEMBL219384
TypeSmall organic molecule
Emp. Form.C29H30F3N3O5
Mol. Mass.557.5608
SMILESCC(C)(C)c1ccc(cc1)N(Cc1ccc(cc1)C(=O)NCCC(O)=O)C(=O)Nc1ccc(OC(F)(F)F)cc1