Reaction Details
TargetMitogen-activated protein kinase kinase kinase 8
LigandBDBM50265279
Substrate/Competitorn/a
Meas. Tech.ChEMBL_496717 (CHEMBL1005354)
IC50 1700±n/a nM
Citation George, DFriedman, MAllen, HArgiriadi, MBarberis, CBischoff, AClabbers, ACusack, KDixon, RFix-Stenzel, SGordon, TJanssen, BJia, YMoskey, MQuinn, CSalmeron, JAWishart, NWoller, KYu, Z Discovery of thieno[2,3-c]pyridines as potent COT inhibitors. Bioorg Med Chem Lett18:4952-5 (2008) 
 
Mitogen-activated protein kinase kinase kinase 8
Name:Mitogen-activated protein kinase kinase kinase 8
Type:Serine/threonine-protein kinase
Mol. Mass.:52916.89
Organism:Homo sapiens (Human)
Description:P41279
Residue:467
BDBM50265279
NameBDBM50265279
Synonyms:4-(biphenyl-3-yloxy)-2-(2H-tetrazol-5-yl)thieno[2,3-c]pyridine | CHEMBL497367
TypeSmall organic molecule
Emp. Form.C20H13N5OS
Mol. Mass.371.415
SMILESO(c1cccc(c1)-c1ccccc1)c1cncc2sc(cc12)-c1nnn[nH]1