Reaction Details
TargetMitogen-activated protein kinase kinase kinase 8
LigandBDBM28042
Substrate/Competitorn/a
Meas. Tech.ChEMBL_496717 (CHEMBL1005354)
IC50 150±n/a nM
Citation George, DFriedman, MAllen, HArgiriadi, MBarberis, CBischoff, AClabbers, ACusack, KDixon, RFix-Stenzel, SGordon, TJanssen, BJia, YMoskey, MQuinn, CSalmeron, JAWishart, NWoller, KYu, Z Discovery of thieno[2,3-c]pyridines as potent COT inhibitors. Bioorg Med Chem Lett18:4952-5 (2008) 
 
Mitogen-activated protein kinase kinase kinase 8
Name:Mitogen-activated protein kinase kinase kinase 8
Type:Serine/threonine-protein kinase
Mol. Mass.:52916.89
Organism:Homo sapiens (Human)
Description:P41279
Residue:467
BDBM28042
NameBDBM28042
Synonyms:5-[4-(4-phenylphenoxy)thieno[2,3-c]pyridin-2-yl]-1H-1,2,3,4-tetrazole thieno[2,3-c]pyridine, 7
TypeSmall organic molecule
Emp. Form.C20H13N5OS
Mol. Mass.371.415
SMILESO(c1ccc(cc1)-c1ccccc1)c1cncc2sc(cc12)-c1nnn[nH]1