Reaction Details
TargetMitogen-activated protein kinase kinase kinase 8
LigandBDBM50264773
Substrate/Competitorn/a
Meas. Tech.ChEMBL_496717 (CHEMBL1005354)
IC50 50±n/a nM
Citation George, DFriedman, MAllen, HArgiriadi, MBarberis, CBischoff, AClabbers, ACusack, KDixon, RFix-Stenzel, SGordon, TJanssen, BJia, YMoskey, MQuinn, CSalmeron, JAWishart, NWoller, KYu, Z Discovery of thieno[2,3-c]pyridines as potent COT inhibitors. Bioorg Med Chem Lett18:4952-5 (2008) 
 
Mitogen-activated protein kinase kinase kinase 8
Name:Mitogen-activated protein kinase kinase kinase 8
Type:Serine/threonine-protein kinase
Mol. Mass.:52916.89
Organism:Homo sapiens (Human)
Description:P41279
Residue:467
BDBM50264773
NameBDBM50264773
Synonyms:4'-(2-(2H-tetrazol-5-yl)thieno[2,3-c]pyridin-4-yloxy)-N,N-dimethylbiphenyl-4-carboxamide | CHEMBL489812
TypeSmall organic molecule
Emp. Form.C23H18N6O2S
Mol. Mass.442.493
SMILESCN(C)C(=O)c1ccc(cc1)-c1ccc(Oc2cncc3sc(cc23)-c2nnn[nH]2)cc1