Reaction Details
TargetMitogen-activated protein kinase kinase kinase 8
LigandBDBM50264742
Substrate/Competitorn/a
Meas. Tech.ChEMBL_496720 (CHEMBL1005357)
IC50 560±n/a nM
Citation George, DFriedman, MAllen, HArgiriadi, MBarberis, CBischoff, AClabbers, ACusack, KDixon, RFix-Stenzel, SGordon, TJanssen, BJia, YMoskey, MQuinn, CSalmeron, JAWishart, NWoller, KYu, Z Discovery of thieno[2,3-c]pyridines as potent COT inhibitors. Bioorg Med Chem Lett18:4952-5 (2008) 
 
Mitogen-activated protein kinase kinase kinase 8
Name:Mitogen-activated protein kinase kinase kinase 8
Type:Serine/threonine-protein kinase
Mol. Mass.:52916.89
Organism:Homo sapiens (Human)
Description:P41279
Residue:467
BDBM50264742
NameBDBM50264742
Synonyms:2-(2H-tetrazol-5-yl)-4-(4'-(trifluoromethyl)biphenyl-4-yloxy)thieno[2,3-c]pyridine | CHEMBL490423
TypeSmall organic molecule
Emp. Form.C21H12F3N5OS
Mol. Mass.439.413
SMILESFC(F)(F)c1ccc(cc1)-c1ccc(Oc2cncc3sc(cc23)-c2nnn[nH]2)cc1