Reaction Details
TargetMitogen-activated protein kinase kinase kinase 8
LigandBDBM50265241
Substrate/Competitorn/a
Meas. Tech.ChEMBL_496717 (CHEMBL1005354)
IC50>50000±n/a nM
Citation George, DFriedman, MAllen, HArgiriadi, MBarberis, CBischoff, AClabbers, ACusack, KDixon, RFix-Stenzel, SGordon, TJanssen, BJia, YMoskey, MQuinn, CSalmeron, JAWishart, NWoller, KYu, Z Discovery of thieno[2,3-c]pyridines as potent COT inhibitors. Bioorg Med Chem Lett18:4952-5 (2008) 
 
Mitogen-activated protein kinase kinase kinase 8
Name:Mitogen-activated protein kinase kinase kinase 8
Type:Serine/threonine-protein kinase
Mol. Mass.:52916.89
Organism:Homo sapiens (Human)
Description:P41279
Residue:467
BDBM50265241
NameBDBM50265241
Synonyms:CHEMBL496947 | N-(4-(4-iodophenoxy)thieno[2,3-c]pyridin-2-yl)acetamide
TypeSmall organic molecule
Emp. Form.C15H11IN2O2S
Mol. Mass.410.23
SMILESCC(=O)Nc1cc2c(Oc3ccc(I)cc3)cncc2s1