Reaction Details
TargetPotassium voltage-gated channel subfamily H member 2
LigandBDBM50263555
Substrate/Competitorn/a
Meas. Tech.ChEMBL_535682 (CHEMBL988836)
IC50 710±n/a nM
Citation Irie, OKosaka, TKishida, MSakaki, JMasuya, KKonishi, KYokokawa, FEhara, TIwasaki, AIwaki, YHitomi, YToyao, AGunji, HTeno, NIwasaki, GHirao, HKanazawa, TTanabe, KHiestand, PCMalcangio, MFox, AJBevan, SJYaqoob, MCulshaw, AJHart, TWHallett, A Overcoming hERG issues for brain-penetrating cathepsin S inhibitors: 2-cyanopyrimidines. Part 2. Bioorg Med Chem Lett18:5280-4 (2008) 
 
Potassium voltage-gated channel subfamily H member 2
Name:Potassium voltage-gated channel subfamily H member 2
Type:Multi-pass membrane protein
Mol. Mass.:126672.65
Organism:Homo sapiens (Human)
Description:Q12809
Residue:1159
BDBM50263555
NameBDBM50263555
Synonyms:2-cyano-N-methyl-4-((1-methylpiperidin-4-yl)methoxy)-6-(spiro[3.5]nonan-7-ylmethylamino)pyrimidine-5-carboxamide | CHEMBL515025
TypeSmall organic molecule
Emp. Form.C24H36N6O2
Mol. Mass.440.5816
SMILESCNC(=O)c1c(NCC2CCC3(CCC3)CC2)nc(nc1OCC1CCN(C)CC1)C#N