Reaction Details
TargetCathepsin S
LigandBDBM50263609
Substrate/Competitorn/a
Meas. Tech.ChEMBL_535680 (CHEMBL988834)
IC50 3±n/a nM
Citation Irie, OKosaka, TKishida, MSakaki, JMasuya, KKonishi, KYokokawa, FEhara, TIwasaki, AIwaki, YHitomi, YToyao, AGunji, HTeno, NIwasaki, GHirao, HKanazawa, TTanabe, KHiestand, PCMalcangio, MFox, AJBevan, SJYaqoob, MCulshaw, AJHart, TWHallett, A Overcoming hERG issues for brain-penetrating cathepsin S inhibitors: 2-cyanopyrimidines. Part 2. Bioorg Med Chem Lett18:5280-4 (2008) 
 
Cathepsin S
Name:Cathepsin S
Type:Protein
Mol. Mass.:37507.38
Organism:Homo sapiens (Human)
Description:P25774
Residue:331
BDBM50263609
NameBDBM50263609
Synonyms:2-cyano-4-((1-(2-hydroxyethyl)piperidin-4-yl)methoxy)-N-methyl-6-(spiro[3.5]nonan-7-ylmethylamino)pyrimidine-5-carboxamide | CHEMBL514042
TypeSmall organic molecule
Emp. Form.C25H38N6O3
Mol. Mass.470.6076
SMILESCNC(=O)c1c(NCC2CCC3(CCC3)CC2)nc(nc1OCC1CCN(CCO)CC1)C#N