Reaction Details
TargetCathepsin S
LigandBDBM50263612
Substrate/Competitorn/a
Meas. Tech.ChEMBL_535680 (CHEMBL988834)
IC50 10±n/a nM
Citation Irie, OKosaka, TKishida, MSakaki, JMasuya, KKonishi, KYokokawa, FEhara, TIwasaki, AIwaki, YHitomi, YToyao, AGunji, HTeno, NIwasaki, GHirao, HKanazawa, TTanabe, KHiestand, PCMalcangio, MFox, AJBevan, SJYaqoob, MCulshaw, AJHart, TWHallett, A Overcoming hERG issues for brain-penetrating cathepsin S inhibitors: 2-cyanopyrimidines. Part 2. Bioorg Med Chem Lett18:5280-4 (2008) 
 
Cathepsin S
Name:Cathepsin S
Type:Protein
Mol. Mass.:37507.38
Organism:Homo sapiens (Human)
Description:P25774
Residue:331
BDBM50263612
NameBDBM50263612
Synonyms:4-((1-acetylpiperidin-4-yl)methoxy)-2-cyano-N-methyl-6-(spiro[3.5]nonan-7-ylmethylamino)pyrimidine-5-carboxamide | CHEMBL478436
TypeSmall organic molecule
Emp. Form.C25H36N6O3
Mol. Mass.468.5917
SMILESCNC(=O)c1c(NCC2CCC3(CCC3)CC2)nc(nc1OCC1CCN(CC1)C(C)=O)C#N