Reaction Details
TargetCathepsin S
LigandBDBM50263667
Substrate/Competitorn/a
Meas. Tech.ChEMBL_535680 (CHEMBL988834)
IC50 6±n/a nM
Citation Irie, OKosaka, TKishida, MSakaki, JMasuya, KKonishi, KYokokawa, FEhara, TIwasaki, AIwaki, YHitomi, YToyao, AGunji, HTeno, NIwasaki, GHirao, HKanazawa, TTanabe, KHiestand, PCMalcangio, MFox, AJBevan, SJYaqoob, MCulshaw, AJHart, TWHallett, A Overcoming hERG issues for brain-penetrating cathepsin S inhibitors: 2-cyanopyrimidines. Part 2. Bioorg Med Chem Lett18:5280-4 (2008) 
 
Cathepsin S
Name:Cathepsin S
Type:Protein
Mol. Mass.:37507.38
Organism:Homo sapiens (Human)
Description:P25774
Residue:331
BDBM50263667
NameBDBM50263667
Synonyms:2-cyano-4-(2-hydroxyethoxy)-N-methyl-6-(spiro[3.5]nonan-7-ylmethylamino)pyrimidine-5-carboxamide | CHEMBL477600
TypeSmall organic molecule
Emp. Form.C19H27N5O3
Mol. Mass.373.4494
SMILESCNC(=O)c1c(NCC2CCC3(CCC3)CC2)nc(nc1OCCO)C#N