Reaction Details
TargetTransient receptor potential cation channel subfamily V member 1
LigandBDBM50263384
Substrate/Competitorn/a
Meas. Tech.ChEMBL_536371 (CHEMBL994289)
pH5.3±n/a
IC50 100±n/a nM
Commentsextracted
Citation Westaway, SMThompson, MRami, HKStemp, GTrouw, LSMitchell, DJSeal, JTMedhurst, SJLappin, SCBiggs, JWright, JArpino, SJerman, JCCryan, JEHolland, VWinborn, KYColeman, TStevens, AJDavis, JBGunthorpe, MJ Design and synthesis of 6-phenylnicotinamide derivatives as antagonists of TRPV1. Bioorg Med Chem Lett18:5609-13 (2008) 
 
Transient receptor potential cation channel subfamily V member 1
Name:Transient receptor potential cation channel subfamily V member 1
Type:Transient Receptor
Mol. Mass.:94956.12
Organism:Rattus norvegicus (rat)
Description:O35433
Residue:838
BDBM50263384
NameBDBM50263384
Synonyms:6-(4-fluorophenyl)-2-methyl-N-(2-methylbenzothiazol-5-yl)nicotinamide SB-782443
TypeSmall organic molecule
Emp. Form.C21H16FN3OS
Mol. Mass.377.435
SMILESCc1nc2cc(NC(=O)c3ccc(nc3C)-c3ccc(F)cc3)ccc2s1