Reaction Details
TargetPeroxisome proliferator-activated receptor gamma
LigandBDBM24566
Substrate/Competitorn/a
Meas. Tech.ChEMBL_492848 (CHEMBL941195)
EC50 1600±n/a nM
Citation Fracchiolla, GLavecchia, ALaghezza, APiemontese, LTrisolini, RCarbonara, GTortorella, PNovellino, ELoiodice, F Synthesis, biological evaluation, and molecular modeling investigation of chiral 2-(4-chloro-phenoxy)-3-phenyl-propanoic acid derivatives with PPARalpha and PPARgamma agonist activity. Bioorg Med Chem16:9498-510 (2008) 
 
Peroxisome proliferator-activated receptor gamma
Name:Peroxisome proliferator-activated receptor gamma
Type:Nuclear Receptor
Mol. Mass.:57613.46
Organism:Homo sapiens (Human)
Description:P37231
Residue:505
BDBM24566
NameBDBM24566
Synonyms:2-({4-chloro-6-[(2,3-dimethylphenyl)amino]pyrimidin-2-yl}sulfanyl)acetic acid JMC515449 Compound 1 Wyeth 14,643
TypeSmall organic molecule
Emp. Form.C14H14ClN3O2S
Mol. Mass.323.798
SMILESCc1cccc(Nc2cc(Cl)nc(SCC(O)=O)n2)c1C