Reaction Details
TargetGonadotropin-releasing hormone receptor
LigandBDBM50274931
Substrate/Competitorn/a
Meas. Tech.ChEMBL_495151 (CHEMBL1008930)
Ki 1.1±n/a nM
Citation Chen, CWu, DGuo, ZXie, QReinhart, GJMadan, AWen, JChen, THuang, CQChen, MChen, YTucci, FCRowbottom, MPontillo, JZhu, YFWade, WSaunders, JBozigian, HStruthers, RS Discovery of sodium R-(+)-4-{2-[5-(2-fluoro-3-methoxyphenyl)-3-(2-fluoro-6-[trifluoromethyl]benzyl)-4-methyl-2,6-dioxo-3,6-dihydro-2H-pyrimidin-1-yl]-1-phenylethylamino}butyrate (elagolix), a potent and orally available nonpeptide antagonist of the human gonadotropin-releasing hormone receptor. J Med Chem51:7478-85 (2009) 
 
Gonadotropin-releasing hormone receptor
Name:Gonadotropin-releasing hormone receptor
Type:Enzyme
Mol. Mass.:37749.45
Organism:Homo sapiens (Human)
Description:P30968
Residue:328
BDBM50274931
NameBDBM50274931
Synonyms:(R)-4-{2-[5-(2-Fluoro-3-methoxyphenyl)-3-(2-chloro-6-fluorobenzyl)-4-methyl-2,6-dioxo-3,6-dihydro-2H-pyrimidin-1-yl]-1-phenylethylamino}butyric Acid | CHEMBL502341
TypeSmall organic molecule
Emp. Form.C31H30ClF2N3O5
Mol. Mass.598.037
SMILESCOc1cccc(c1F)-c1c(C)n(Cc2c(F)cccc2Cl)c(=O)n(C[C@H](NCCCC(O)=O)c2ccccc2)c1=O