Reaction Details
TargetCytochrome P450 3A4
LigandBDBM50254969
Substrate/Competitorn/a
Meas. Tech.ChEMBL_559938 (CHEMBL1013732)
IC50 8400±n/a nM
Citation Westaway, SMBrown, SLConway, EHeightman, TDJohnson, CNLapsley, KMacdonald, GJMacPherson, DTMitchell, DJMyatt, JWSeal, JTStanway, SJStemp, GThompson, MCelestini, PColombo, AConsonni, AGagliardi, SRiccaboni, MRonzoni, SBriggs, MAMatthews, KLStevens, AJBolton, VJBoyfield, IJarvie, EMStratton, SCSanger, GJ The discovery of biaryl carboxamides as novel small molecule agonists of the motilin receptor. Bioorg Med Chem Lett18:6429-36 (2008) 
 
Cytochrome P450 3A4
Name:Cytochrome P450 3A4
Type:Enzyme
Mol. Mass.:57349.57
Organism:Homo sapiens (Human)
Description:n/a
Residue:503
BDBM50254969
NameBDBM50254969
Synonyms:CHEMBL518142 | [4'-((3R,5S)-3,5-Dimethyl-piperazin-1-ylmethyl)-biphenyl-2-yl]-[4-(4-fluoro-phenoxy)-piperidin-1-yl]-methanone
TypeSmall organic molecule
Emp. Form.C31H36FN3O2
Mol. Mass.501.6348
SMILESC[C@H]1CN(Cc2ccc(cc2)-c2ccccc2C(=O)N2CCC(CC2)Oc2ccc(F)cc2)C[C@@H](C)N1