Reaction Details
TargetCytochrome P450 3A4
LigandBDBM50254892
Substrate/Competitorn/a
Meas. Tech.ChEMBL_559939 (CHEMBL1013733)
IC50 1500±n/a nM
Citation Westaway, SMBrown, SLConway, EHeightman, TDJohnson, CNLapsley, KMacdonald, GJMacPherson, DTMitchell, DJMyatt, JWSeal, JTStanway, SJStemp, GThompson, MCelestini, PColombo, AConsonni, AGagliardi, SRiccaboni, MRonzoni, SBriggs, MAMatthews, KLStevens, AJBolton, VJBoyfield, IJarvie, EMStratton, SCSanger, GJ The discovery of biaryl carboxamides as novel small molecule agonists of the motilin receptor. Bioorg Med Chem Lett18:6429-36 (2008) 
 
Cytochrome P450 3A4
Name:Cytochrome P450 3A4
Type:Enzyme
Mol. Mass.:57349.57
Organism:Homo sapiens (Human)
Description:n/a
Residue:503
BDBM50254892
NameBDBM50254892
Synonyms:2-(3-Chloro-phenyl)-N-[4'-((3R,5S)-3,5-dimethyl-piperazin-1-ylmethyl)-biphenyl-2-ylmethyl]-N-methyl-acetamide | CHEMBL465941
TypeSmall organic molecule
Emp. Form.C29H34ClN3O
Mol. Mass.476.053
SMILESC[C@H]1CN(Cc2ccc(cc2)-c2ccccc2CN(C)C(=O)Cc2cccc(Cl)c2)C[C@@H](C)N1