Reaction Details
TargetCytochrome P450 3A4
LigandBDBM50255062
Substrate/Competitorn/a
Meas. Tech.ChEMBL_559939 (CHEMBL1013733)
IC50 5600±n/a nM
Citation Westaway, SMBrown, SLConway, EHeightman, TDJohnson, CNLapsley, KMacdonald, GJMacPherson, DTMitchell, DJMyatt, JWSeal, JTStanway, SJStemp, GThompson, MCelestini, PColombo, AConsonni, AGagliardi, SRiccaboni, MRonzoni, SBriggs, MAMatthews, KLStevens, AJBolton, VJBoyfield, IJarvie, EMStratton, SCSanger, GJ The discovery of biaryl carboxamides as novel small molecule agonists of the motilin receptor. Bioorg Med Chem Lett18:6429-36 (2008) 
 
Cytochrome P450 3A4
Name:Cytochrome P450 3A4
Type:Enzyme
Mol. Mass.:57349.57
Organism:Homo sapiens (Human)
Description:n/a
Residue:503
BDBM50255062
NameBDBM50255062
Synonyms:CHEMBL465925 | {3-[4-((3R,5S)-3,5-Dimethyl-piperazin-1-ylmethyl)-phenyl]-pyridin-2-yl}-[4-(4-fluoro-benzyl)-piperidin-1-yl]-methanone
TypeSmall organic molecule
Emp. Form.C31H37FN4O
Mol. Mass.500.6501
SMILESC[C@H]1CN(Cc2ccc(cc2)-c2cccnc2C(=O)N2CCC(Cc3ccc(F)cc3)CC2)C[C@@H](C)N1