Reaction Details
TargetPeptide deformylase
LigandBDBM50255002
Substrate/Competitorn/a
Meas. Tech.ChEMBL_559976 (CHEMBL1014575)
IC50 15±n/a nM
Citation Pichota, ADuraiswamy, JYin, ZKeller, THAlam, JLiung, SLee, GDing, MWang, GChan, WLSchreiber, MMa, IBeer, DNgew, XMukherjee, KNanjundappa, MTeo, JWThayalan, PYap, ADick, TMeng, WXu, MKoehn, JPan, SHClark, KXie, XShoen, CCynamon, M Peptide deformylase inhibitors of Mycobacterium tuberculosis: synthesis, structural investigations, and biological results. Bioorg Med Chem Lett18:6568-72 (2008) 
 
Peptide deformylase
Name:Peptide deformylase
Type:PROTEIN
Mol. Mass.:20931.95
Organism:Mycobacterium tuberculosis
Description:ChEMBL_559976
Residue:197
BDBM50255002
NameBDBM50255002
Synonyms:CHEMBL482180 | N-((R)-2-((S)-2-(1H-benzo[d]imidazol-2-yl)pyrrolidine-1-carbonyl)heptyl)-N-hydroxyformamide
TypeSmall organic molecule
Emp. Form.C20H28N4O3
Mol. Mass.372.4613
SMILESCCCCC[C@H](CN(O)C=O)C(=O)N1CCC[C@H]1c1nc2ccccc2[nH]1