Reaction Details
TargetLipoprotein lipase
LigandBDBM50253975
Substrate/Competitorn/a
Meas. Tech.ChEMBL_559993 (CHEMBL1018743)
IC50>50000±n/a nM
Citation Goodman, KBBury, MJCheung, MCichy-Knight, MADowdell, SEDunn, AKLee, DLieby, JAMoore, MLScherzer, DASha, DSuarez, DPMurphy, DJHarpel, MRManas, ESMcNulty, DEAnnan, RSMatico, RESchwartz, BKTrill, JJSweitzer, TDWang, DYKeller, PMKrawiec, JAJaye, MC Discovery of potent, selective sulfonylfuran urea endothelial lipase inhibitors. Bioorg Med Chem Lett19:27-30 (2008) 
 
Lipoprotein lipase
Name:Lipoprotein lipase
Type:PROTEIN
Mol. Mass.:53093.31
Organism:Rattus norvegicus
Description:ChEMBL_559993
Residue:474
BDBM50253975
NameBDBM50253975
Synonyms:1-(2-methyl-5-(piperidin-1-ylsulfonyl)-1H-pyrrol-3-yl)-3-phenylurea | CHEMBL462478
TypeSmall organic molecule
Emp. Form.C17H22N4O3S
Mol. Mass.362.447
SMILESCc1[nH]c(cc1NC(=O)Nc1ccccc1)S(=O)(=O)N1CCCCC1